Building ImageJ2 from source on Windows

Previous Topic Next Topic
 
classic Classic list List threaded Threaded
3 messages Options
Reply | Threaded
Open this post in threaded view
|

Building ImageJ2 from source on Windows

MRivers
I am trying to build ImageJ2 on Windows 10 64-bit.  I have installed the latest JDK10 from Oracle and the latest Maven.  I downloaded the latest version of ImageJ from Github, -rc65.



When I first run maven it downloads lots of jar files as expected.  However, it fails with an error.  That was a long output, so I am just appending what I get when I run mvn a second time:



C:\ImageJ2\imagej-imagej-2.0.0-rc-65\imagej-imagej-2.0.0-rc-65>mvn

[INFO] Scanning for projects...

[INFO]

[INFO] -------------------------< net.imagej:imagej >--------------------------

[INFO] Building ImageJ 2.0.0-rc-65

[INFO] --------------------------------[ jar ]---------------------------------

[INFO]

[INFO] --- maven-enforcer-plugin:1.4.1:enforce (enforce-rules) @ imagej ---

[INFO] ------------------------------------------------------------------------

[INFO] BUILD FAILURE

[INFO] ------------------------------------------------------------------------

[INFO] Total time: 2.042 s

[INFO] Finished at: 2018-04-17T08:58:30-05:00

[INFO] ------------------------------------------------------------------------

[ERROR] Failed to execute goal org.apache.maven.plugins:maven-enforcer-plugin:1.4.1:enforce (enforce-rules) on project imagej: Execution enforce-rules of goal org.apache.maven.plugins:maven-enforcer-plugin:1.4.1:enforce failed: An API incompatibility was encountered while executing org.apache.maven.plugins:maven-enforcer-plugin:1.4.1:enforce: java.lang.ExceptionInInitializerError: null

[ERROR] -----------------------------------------------------

[ERROR] realm =    plugin>org.apache.maven.plugins:maven-enforcer-plugin:1.4.1

[ERROR] strategy = org.codehaus.plexus.classworlds.strategy.SelfFirstStrategy

[ERROR] urls[0] = file:/C:/Users/rivers/.m2/repository/org/apache/maven/plugins/maven-enforcer-plugin/1.4.1/maven-enforcer-plugin-1.4.1.jar

[ERROR] urls[1] = file:/C:/Users/rivers/.m2/repository/org/codehaus/mojo/extra-enforcer-rules/1.0-beta-6/extra-enforcer-rules-1.0-beta-6.jar

[ERROR] urls[2] = file:/C:/Users/rivers/.m2/repository/org/apache/maven/shared/maven-dependency-tree/2.2/maven-dependency-tree-2.2.jar

[ERROR] urls[3] = file:/C:/Users/rivers/.m2/repository/org/codehaus/plexus/plexus-component-annotations/1.5.5/plexus-component-annotations-1.5.5.jar

[ERROR] urls[4] = file:/C:/Users/rivers/.m2/repository/org/eclipse/aether/aether-util/0.9.0.M2/aether-util-0.9.0.M2.jar

[ERROR] urls[5] = file:/C:/Users/rivers/.m2/repository/org/apache/maven/shared/maven-common-artifact-filters/1.4/maven-common-artifact-filters-1.4.jar

[ERROR] urls[6] = file:/C:/Users/rivers/.m2/repository/com/ibm/icu/icu4j/56.1/icu4j-56.1.jar

[ERROR] urls[7] = file:/C:/Users/rivers/.m2/repository/org/scijava/scijava-maven-plugin/1.0.0/scijava-maven-plugin-1.0.0.jar

[ERROR] urls[8] = file:/C:/Users/rivers/.m2/repository/backport-util-concurrent/backport-util-concurrent/3.1/backport-util-concurrent-3.1.jar

[ERROR] urls[9] = file:/C:/Users/rivers/.m2/repository/org/codehaus/plexus/plexus-interpolation/1.11/plexus-interpolation-1.11.jar

[ERROR] urls[10] = file:/C:/Users/rivers/.m2/repository/org/slf4j/slf4j-jdk14/1.5.6/slf4j-jdk14-1.5.6.jar

[ERROR] urls[11] = file:/C:/Users/rivers/.m2/repository/org/slf4j/jcl-over-slf4j/1.5.6/jcl-over-slf4j-1.5.6.jar

[ERROR] urls[12] = file:/C:/Users/rivers/.m2/repository/org/apache/maven/reporting/maven-reporting-api/2.2.1/maven-reporting-api-2.2.1.jar

[ERROR] urls[13] = file:/C:/Users/rivers/.m2/repository/org/apache/maven/doxia/doxia-sink-api/1.1/doxia-sink-api-1.1.jar

[ERROR] urls[14] = file:/C:/Users/rivers/.m2/repository/org/apache/maven/doxia/doxia-logging-api/1.1/doxia-logging-api-1.1.jar

[ERROR] urls[15] = file:/C:/Users/rivers/.m2/repository/commons-cli/commons-cli/1.2/commons-cli-1.2.jar

[ERROR] urls[16] = file:/C:/Users/rivers/.m2/repository/org/codehaus/plexus/plexus-interactivity-api/1.0-alpha-4/plexus-interactivity-api-1.0-alpha-4.jar

[ERROR] urls[17] = file:/C:/Users/rivers/.m2/repository/org/sonatype/plexus/plexus-sec-dispatcher/1.3/plexus-sec-dispatcher-1.3.jar

[ERROR] urls[18] = file:/C:/Users/rivers/.m2/repository/org/sonatype/plexus/plexus-cipher/1.4/plexus-cipher-1.4.jar

[ERROR] urls[19] = file:/C:/Users/rivers/.m2/repository/org/codehaus/plexus/plexus-utils/3.0.22/plexus-utils-3.0.22.jar

[ERROR] urls[20] = file:/C:/Users/rivers/.m2/repository/commons-lang/commons-lang/2.3/commons-lang-2.3.jar

[ERROR] urls[21] = file:/C:/Users/rivers/.m2/repository/org/apache/maven/enforcer/enforcer-api/1.4.1/enforcer-api-1.4.1.jar

[ERROR] urls[22] = file:/C:/Users/rivers/.m2/repository/org/apache/maven/enforcer/enforcer-rules/1.4.1/enforcer-rules-1.4.1.jar

[ERROR] urls[23] = file:/C:/Users/rivers/.m2/repository/org/beanshell/bsh/2.0b4/bsh-2.0b4.jar

[ERROR] urls[24] = file:/C:/Users/rivers/.m2/repository/org/codehaus/plexus/plexus-i18n/1.0-beta-6/plexus-i18n-1.0-beta-6.jar

[ERROR] urls[25] = file:/C:/Users/rivers/.m2/repository/org/apache/maven/plugin-testing/maven-plugin-testing-harness/1.3/maven-plugin-testing-harness-1.3.jar

[ERROR] urls[26] = file:/C:/Users/rivers/.m2/repository/org/codehaus/plexus/plexus-archiver/2.2/plexus-archiver-2.2.jar

[ERROR] urls[27] = file:/C:/Users/rivers/.m2/repository/org/codehaus/plexus/plexus-io/2.0.4/plexus-io-2.0.4.jar

[ERROR] urls[28] = file:/C:/Users/rivers/.m2/repository/junit/junit/4.11/junit-4.11.jar

[ERROR] urls[29] = file:/C:/Users/rivers/.m2/repository/org/hamcrest/hamcrest-core/1.3/hamcrest-core-1.3.jar

[ERROR] Number of foreign imports: 1

[ERROR] import: Entry[import  from realm ClassRealm[project>net.imagej:imagej:2.0.0-rc-65, parent: ClassRealm[maven.api, parent: null]]]

[ERROR]

[ERROR] -----------------------------------------------------

[ERROR] : begin 0, end 3, length 2

[ERROR] -> [Help 1]

[ERROR]

[ERROR] To see the full stack trace of the errors, re-run Maven with the -e switch.

[ERROR] Re-run Maven using the -X switch to enable full debug logging.

[ERROR]

[ERROR] For more information about the errors and possible solutions, please read the following articles:

[ERROR] [Help 1] http://cwiki.apache.org/confluence/display/MAVEN/PluginContainerException



Any idea what is wrong here?



Thanks,

Mark

























































































































































--
ImageJ mailing list: http://imagej.nih.gov/ij/list.html
Reply | Threaded
Open this post in threaded view
|

Re: Building ImageJ2 from source on Windows

Christopher Gell
Mark,

I suggest just using Fiji. Fiji is ImageJ2 with ImageJ1 compatability....

Chris
_________________________________________________
Dr Chris Gell
School of Life Sciences Imaging and Microscopy (SLIM) Facility,
Advanced Microsocpy Unit (AMU)
Room E100
University of Nottingham
The Medical School
QMC
Nottingham
NG7 2UH

Office:   +44 (0)115 8230297
Mobile: 0777 848 4019
[hidden email]
http://www.nottingham.ac.uk/life-sciences/facilities/slim
Follow us on Twitter @SLIM_Nottingham

-----Original Message-----
From: Mark Rivers <[hidden email]>
Sent: 17 April 2018 15:12
To: [hidden email]
Subject: Building ImageJ2 from source on Windows

I am trying to build ImageJ2 on Windows 10 64-bit.  I have installed the latest JDK10 from Oracle and the latest Maven.  I downloaded the latest version of ImageJ from Github, -rc65.



When I first run maven it downloads lots of jar files as expected.  However, it fails with an error.  That was a long output, so I am just appending what I get when I run mvn a second time:



C:\ImageJ2\imagej-imagej-2.0.0-rc-65\imagej-imagej-2.0.0-rc-65>mvn

[INFO] Scanning for projects...

[INFO]

[INFO] -------------------------< net.imagej:imagej >--------------------------

[INFO] Building ImageJ 2.0.0-rc-65

[INFO] --------------------------------[ jar ]---------------------------------

[INFO]

[INFO] --- maven-enforcer-plugin:1.4.1:enforce (enforce-rules) @ imagej ---

[INFO] ------------------------------------------------------------------------

[INFO] BUILD FAILURE

[INFO] ------------------------------------------------------------------------

[INFO] Total time: 2.042 s

[INFO] Finished at: 2018-04-17T08:58:30-05:00

[INFO] ------------------------------------------------------------------------

[ERROR] Failed to execute goal org.apache.maven.plugins:maven-enforcer-plugin:1.4.1:enforce (enforce-rules) on project imagej: Execution enforce-rules of goal org.apache.maven.plugins:maven-enforcer-plugin:1.4.1:enforce failed: An API incompatibility was encountered while executing org.apache.maven.plugins:maven-enforcer-plugin:1.4.1:enforce: java.lang.ExceptionInInitializerError: null

[ERROR] -----------------------------------------------------

[ERROR] realm =    plugin>org.apache.maven.plugins:maven-enforcer-plugin:1.4.1

[ERROR] strategy = org.codehaus.plexus.classworlds.strategy.SelfFirstStrategy

[ERROR] urls[0] = file:/C:/Users/rivers/.m2/repository/org/apache/maven/plugins/maven-enforcer-plugin/1.4.1/maven-enforcer-plugin-1.4.1.jar

[ERROR] urls[1] = file:/C:/Users/rivers/.m2/repository/org/codehaus/mojo/extra-enforcer-rules/1.0-beta-6/extra-enforcer-rules-1.0-beta-6.jar

[ERROR] urls[2] = file:/C:/Users/rivers/.m2/repository/org/apache/maven/shared/maven-dependency-tree/2.2/maven-dependency-tree-2.2.jar

[ERROR] urls[3] = file:/C:/Users/rivers/.m2/repository/org/codehaus/plexus/plexus-component-annotations/1.5.5/plexus-component-annotations-1.5.5.jar

[ERROR] urls[4] = file:/C:/Users/rivers/.m2/repository/org/eclipse/aether/aether-util/0.9.0.M2/aether-util-0.9.0.M2.jar

[ERROR] urls[5] = file:/C:/Users/rivers/.m2/repository/org/apache/maven/shared/maven-common-artifact-filters/1.4/maven-common-artifact-filters-1.4.jar

[ERROR] urls[6] = file:/C:/Users/rivers/.m2/repository/com/ibm/icu/icu4j/56.1/icu4j-56.1.jar

[ERROR] urls[7] = file:/C:/Users/rivers/.m2/repository/org/scijava/scijava-maven-plugin/1.0.0/scijava-maven-plugin-1.0.0.jar

[ERROR] urls[8] = file:/C:/Users/rivers/.m2/repository/backport-util-concurrent/backport-util-concurrent/3.1/backport-util-concurrent-3.1.jar

[ERROR] urls[9] = file:/C:/Users/rivers/.m2/repository/org/codehaus/plexus/plexus-interpolation/1.11/plexus-interpolation-1.11.jar

[ERROR] urls[10] = file:/C:/Users/rivers/.m2/repository/org/slf4j/slf4j-jdk14/1.5.6/slf4j-jdk14-1.5.6.jar

[ERROR] urls[11] = file:/C:/Users/rivers/.m2/repository/org/slf4j/jcl-over-slf4j/1.5.6/jcl-over-slf4j-1.5.6.jar

[ERROR] urls[12] = file:/C:/Users/rivers/.m2/repository/org/apache/maven/reporting/maven-reporting-api/2.2.1/maven-reporting-api-2.2.1.jar

[ERROR] urls[13] = file:/C:/Users/rivers/.m2/repository/org/apache/maven/doxia/doxia-sink-api/1.1/doxia-sink-api-1.1.jar

[ERROR] urls[14] = file:/C:/Users/rivers/.m2/repository/org/apache/maven/doxia/doxia-logging-api/1.1/doxia-logging-api-1.1.jar

[ERROR] urls[15] = file:/C:/Users/rivers/.m2/repository/commons-cli/commons-cli/1.2/commons-cli-1.2.jar

[ERROR] urls[16] = file:/C:/Users/rivers/.m2/repository/org/codehaus/plexus/plexus-interactivity-api/1.0-alpha-4/plexus-interactivity-api-1.0-alpha-4.jar

[ERROR] urls[17] = file:/C:/Users/rivers/.m2/repository/org/sonatype/plexus/plexus-sec-dispatcher/1.3/plexus-sec-dispatcher-1.3.jar

[ERROR] urls[18] = file:/C:/Users/rivers/.m2/repository/org/sonatype/plexus/plexus-cipher/1.4/plexus-cipher-1.4.jar

[ERROR] urls[19] = file:/C:/Users/rivers/.m2/repository/org/codehaus/plexus/plexus-utils/3.0.22/plexus-utils-3.0.22.jar

[ERROR] urls[20] = file:/C:/Users/rivers/.m2/repository/commons-lang/commons-lang/2.3/commons-lang-2.3.jar

[ERROR] urls[21] = file:/C:/Users/rivers/.m2/repository/org/apache/maven/enforcer/enforcer-api/1.4.1/enforcer-api-1.4.1.jar

[ERROR] urls[22] = file:/C:/Users/rivers/.m2/repository/org/apache/maven/enforcer/enforcer-rules/1.4.1/enforcer-rules-1.4.1.jar

[ERROR] urls[23] = file:/C:/Users/rivers/.m2/repository/org/beanshell/bsh/2.0b4/bsh-2.0b4.jar

[ERROR] urls[24] = file:/C:/Users/rivers/.m2/repository/org/codehaus/plexus/plexus-i18n/1.0-beta-6/plexus-i18n-1.0-beta-6.jar

[ERROR] urls[25] = file:/C:/Users/rivers/.m2/repository/org/apache/maven/plugin-testing/maven-plugin-testing-harness/1.3/maven-plugin-testing-harness-1.3.jar

[ERROR] urls[26] = file:/C:/Users/rivers/.m2/repository/org/codehaus/plexus/plexus-archiver/2.2/plexus-archiver-2.2.jar

[ERROR] urls[27] = file:/C:/Users/rivers/.m2/repository/org/codehaus/plexus/plexus-io/2.0.4/plexus-io-2.0.4.jar

[ERROR] urls[28] = file:/C:/Users/rivers/.m2/repository/junit/junit/4.11/junit-4.11.jar

[ERROR] urls[29] = file:/C:/Users/rivers/.m2/repository/org/hamcrest/hamcrest-core/1.3/hamcrest-core-1.3.jar

[ERROR] Number of foreign imports: 1

[ERROR] import: Entry[import  from realm ClassRealm[project>net.imagej:imagej:2.0.0-rc-65, parent: ClassRealm[maven.api, parent: null]]]

[ERROR]

[ERROR] -----------------------------------------------------

[ERROR] : begin 0, end 3, length 2

[ERROR] -> [Help 1]

[ERROR]

[ERROR] To see the full stack trace of the errors, re-run Maven with the -e switch.

[ERROR] Re-run Maven using the -X switch to enable full debug logging.

[ERROR]

[ERROR] For more information about the errors and possible solutions, please read the following articles:

[ERROR] [Help 1] http://cwiki.apache.org/confluence/display/MAVEN/PluginContainerException



Any idea what is wrong here?



Thanks,

Mark

























































































































































--
ImageJ mailing list: http://imagej.nih.gov/ij/list.html



This message and any attachment are intended solely for the addressee
and may contain confidential information. If you have received this
message in error, please contact the sender and delete the email and
attachment.

Any views or opinions expressed by the author of this email do not
necessarily reflect the views of the University of Nottingham. Email
communications with the University of Nottingham may be monitored
where permitted by law.






--
ImageJ mailing list: http://imagej.nih.gov/ij/list.html
Reply | Threaded
Open this post in threaded view
|

Re: Building ImageJ2 from source on Windows

ctrueden
In reply to this post by MRivers
Hi Mark,

I second Chris's advice to download Fiji from:
   https://fiji.sc/#download

Fiji is built on ImageJ2, and is the simplest way currently to get an
end-user installation of it.

If you do really want to compile ImageJ2 from source, please read:
    https://imagej.net/Source

Note that building the imagej/imagej project on GitHub will only compile a
very small number of .java files; most of the code lives in other
components, which are dependencies of imagej/imagej.

I would not generally recommend downloading a source bundle from GitHub's
releases page. Rather, I'd clone the Git repository and build master.
However, what you did is supposed to work—I tested 2.0.0-rc-65 on macOS
10.13.4 and it built locally for me. I am not sure what the error above
means, but if you are curious you could run again with "mvn -X" to print
more debug messages and hopefully get a stack trace.

Regards,
Curtis

--
Curtis Rueden
LOCI software architect - https://loci.wisc.edu/software
ImageJ2 lead, Fiji maintainer - https://imagej.net/User:Rueden
Did you know ImageJ has a forum? http://forum.imagej.net/


On Tue, Apr 17, 2018 at 9:12 AM, Mark Rivers <[hidden email]>
wrote:

> I am trying to build ImageJ2 on Windows 10 64-bit.  I have installed the
> latest JDK10 from Oracle and the latest Maven.  I downloaded the latest
> version of ImageJ from Github, -rc65.
>
>
>
> When I first run maven it downloads lots of jar files as expected.
> However, it fails with an error.  That was a long output, so I am just
> appending what I get when I run mvn a second time:
>
>
>
> C:\ImageJ2\imagej-imagej-2.0.0-rc-65\imagej-imagej-2.0.0-rc-65>mvn
>
> [INFO] Scanning for projects...
>
> [INFO]
>
> [INFO] -------------------------< net.imagej:imagej
> >--------------------------
>
> [INFO] Building ImageJ 2.0.0-rc-65
>
> [INFO] --------------------------------[ jar
> ]---------------------------------
>
> [INFO]
>
> [INFO] --- maven-enforcer-plugin:1.4.1:enforce (enforce-rules) @ imagej
> ---
>
> [INFO] ------------------------------------------------------------
> ------------
>
> [INFO] BUILD FAILURE
>
> [INFO] ------------------------------------------------------------
> ------------
>
> [INFO] Total time: 2.042 s
>
> [INFO] Finished at: 2018-04-17T08:58:30-05:00
>
> [INFO] ------------------------------------------------------------
> ------------
>
> [ERROR] Failed to execute goal org.apache.maven.plugins:
> maven-enforcer-plugin:1.4.1:enforce (enforce-rules) on project imagej:
> Execution enforce-rules of goal org.apache.maven.plugins:
> maven-enforcer-plugin:1.4.1:enforce failed: An API incompatibility was
> encountered while executing org.apache.maven.plugins:
> maven-enforcer-plugin:1.4.1:enforce: java.lang.ExceptionInInitializerError:
> null
>
> [ERROR] -----------------------------------------------------
>
> [ERROR] realm =    plugin>org.apache.maven.plugins:maven-enforcer-plugin:
> 1.4.1
>
> [ERROR] strategy = org.codehaus.plexus.classworlds.strategy.
> SelfFirstStrategy
>
> [ERROR] urls[0] = file:/C:/Users/rivers/.m2/repository/org/apache/maven/
> plugins/maven-enforcer-plugin/1.4.1/maven-enforcer-plugin-1.4.1.jar
>
> [ERROR] urls[1] = file:/C:/Users/rivers/.m2/repository/org/codehaus/mojo/
> extra-enforcer-rules/1.0-beta-6/extra-enforcer-rules-1.0-beta-6.jar
>
> [ERROR] urls[2] = file:/C:/Users/rivers/.m2/repository/org/apache/maven/
> shared/maven-dependency-tree/2.2/maven-dependency-tree-2.2.jar
>
> [ERROR] urls[3] = file:/C:/Users/rivers/.m2/repository/org/codehaus/
> plexus/plexus-component-annotations/1.5.5/plexus-
> component-annotations-1.5.5.jar
>
> [ERROR] urls[4] = file:/C:/Users/rivers/.m2/repository/org/eclipse/aether/
> aether-util/0.9.0.M2/aether-util-0.9.0.M2.jar
>
> [ERROR] urls[5] = file:/C:/Users/rivers/.m2/repository/org/apache/maven/
> shared/maven-common-artifact-filters/1.4/maven-common-
> artifact-filters-1.4.jar
>
> [ERROR] urls[6] = file:/C:/Users/rivers/.m2/repository/com/ibm/icu/icu4j/
> 56.1/icu4j-56.1.jar
>
> [ERROR] urls[7] = file:/C:/Users/rivers/.m2/repository/org/scijava/
> scijava-maven-plugin/1.0.0/scijava-maven-plugin-1.0.0.jar
>
> [ERROR] urls[8] = file:/C:/Users/rivers/.m2/repository/backport-util-
> concurrent/backport-util-concurrent/3.1/backport-util-concurrent-3.1.jar
>
> [ERROR] urls[9] = file:/C:/Users/rivers/.m2/repository/org/codehaus/
> plexus/plexus-interpolation/1.11/plexus-interpolation-1.11.jar
>
> [ERROR] urls[10] = file:/C:/Users/rivers/.m2/repository/org/slf4j/slf4j-
> jdk14/1.5.6/slf4j-jdk14-1.5.6.jar
>
> [ERROR] urls[11] = file:/C:/Users/rivers/.m2/
> repository/org/slf4j/jcl-over-slf4j/1.5.6/jcl-over-slf4j-1.5.6.jar
>
> [ERROR] urls[12] = file:/C:/Users/rivers/.m2/repository/org/apache/maven/
> reporting/maven-reporting-api/2.2.1/maven-reporting-api-2.2.1.jar
>
> [ERROR] urls[13] = file:/C:/Users/rivers/.m2/repository/org/apache/maven/
> doxia/doxia-sink-api/1.1/doxia-sink-api-1.1.jar
>
> [ERROR] urls[14] = file:/C:/Users/rivers/.m2/repository/org/apache/maven/
> doxia/doxia-logging-api/1.1/doxia-logging-api-1.1.jar
>
> [ERROR] urls[15] = file:/C:/Users/rivers/.m2/repository/commons-cli/
> commons-cli/1.2/commons-cli-1.2.jar
>
> [ERROR] urls[16] = file:/C:/Users/rivers/.m2/repository/org/codehaus/
> plexus/plexus-interactivity-api/1.0-alpha-4/plexus-
> interactivity-api-1.0-alpha-4.jar
>
> [ERROR] urls[17] = file:/C:/Users/rivers/.m2/repository/org/sonatype/
> plexus/plexus-sec-dispatcher/1.3/plexus-sec-dispatcher-1.3.jar
>
> [ERROR] urls[18] = file:/C:/Users/rivers/.m2/repository/org/sonatype/
> plexus/plexus-cipher/1.4/plexus-cipher-1.4.jar
>
> [ERROR] urls[19] = file:/C:/Users/rivers/.m2/repository/org/codehaus/
> plexus/plexus-utils/3.0.22/plexus-utils-3.0.22.jar
>
> [ERROR] urls[20] = file:/C:/Users/rivers/.m2/repository/commons-lang/
> commons-lang/2.3/commons-lang-2.3.jar
>
> [ERROR] urls[21] = file:/C:/Users/rivers/.m2/repository/org/apache/maven/
> enforcer/enforcer-api/1.4.1/enforcer-api-1.4.1.jar
>
> [ERROR] urls[22] = file:/C:/Users/rivers/.m2/repository/org/apache/maven/
> enforcer/enforcer-rules/1.4.1/enforcer-rules-1.4.1.jar
>
> [ERROR] urls[23] = file:/C:/Users/rivers/.m2/repository/org/beanshell/bsh/
> 2.0b4/bsh-2.0b4.jar
>
> [ERROR] urls[24] = file:/C:/Users/rivers/.m2/repository/org/codehaus/
> plexus/plexus-i18n/1.0-beta-6/plexus-i18n-1.0-beta-6.jar
>
> [ERROR] urls[25] = file:/C:/Users/rivers/.m2/repository/org/apache/maven/
> plugin-testing/maven-plugin-testing-harness/1.3/maven-
> plugin-testing-harness-1.3.jar
>
> [ERROR] urls[26] = file:/C:/Users/rivers/.m2/repository/org/codehaus/
> plexus/plexus-archiver/2.2/plexus-archiver-2.2.jar
>
> [ERROR] urls[27] = file:/C:/Users/rivers/.m2/repository/org/codehaus/
> plexus/plexus-io/2.0.4/plexus-io-2.0.4.jar
>
> [ERROR] urls[28] = file:/C:/Users/rivers/.m2/repository/junit/junit/4.11/
> junit-4.11.jar
>
> [ERROR] urls[29] = file:/C:/Users/rivers/.m2/repository/org/hamcrest/
> hamcrest-core/1.3/hamcrest-core-1.3.jar
>
> [ERROR] Number of foreign imports: 1
>
> [ERROR] import: Entry[import  from realm ClassRealm[project>net.imagej:imagej:2.0.0-rc-65,
> parent: ClassRealm[maven.api, parent: null]]]
>
> [ERROR]
>
> [ERROR] -----------------------------------------------------
>
> [ERROR] : begin 0, end 3, length 2
>
> [ERROR] -> [Help 1]
>
> [ERROR]
>
> [ERROR] To see the full stack trace of the errors, re-run Maven with the
> -e switch.
>
> [ERROR] Re-run Maven using the -X switch to enable full debug logging.
>
> [ERROR]
>
> [ERROR] For more information about the errors and possible solutions,
> please read the following articles:
>
> [ERROR] [Help 1] http://cwiki.apache.org/confluence/display/MAVEN/
> PluginContainerException
>
>
>
> Any idea what is wrong here?
>
>
>
> Thanks,
>
> Mark
>
>
>
>
>
>
>
>
>
>
>
>
>
>
>
>
>
>
>
>
>
>
>
>
>
>
>
>
>
>
>
>
>
>
>
>
>
>
>
>
>
>
>
>
>
>
>
>
>
>
>
>
>
>
>
>
>
>
>
>
>
>
>
>
>
>
>
>
>
>
>
>
>
>
>
>
>
>
>
>
>
>
>
>
>
>
>
>
>
>
>
>
>
>
>
>
>
>
>
>
>
>
>
>
>
>
>
>
>
>
>
>
>
>
>
>
>
>
>
>
>
>
>
>
>
>
>
>
>
>
>
>
>
>
>
>
>
>
>
>
>
>
>
>
>
>
>
>
>
>
>
>
>
> --
> ImageJ mailing list: http://imagej.nih.gov/ij/list.html
>

--
ImageJ mailing list: http://imagej.nih.gov/ij/list.html